{"text_format":"1","workbook":"xlsx","n_sheets":3,"sheets":["記入","ID","集約"],"not_rendered":{"charts":0,"images":0,"macros":1,"external_links":0,"defined_names":2,"comments":0,"pivot_tables":0},"unopened":[],"bounds":{"document_bytes":16777216,"sheet_cells":100000,"rows_first":2000,"rows_last":500,"rows_between":2000,"halvings":0,"cell_chars":16384,"cell_head_chars":4096},"cells_cut":0,"cells_raw":0,"read":"whole","date_system":"1900"}

{"sheet":"記入","index":0,"n_rows":47,"n_cols":23,"rows_kept":47,"cut":false,"hidden":false,"merged":[[7,2,11,2],[3,4,3,8],[4,2,4,16],[9,4,9,16],[11,4,11,16],[33,15,33,16],[34,15,34,16],[32,15,32,16],[31,15,31,16],[7,4,7,16],[13,5,13,8],[18,3,18,4],[18,6,18,10],[13,3,13,4],[16,15,16,16],[16,3,16,10],[17,6,17,10],[17,3,17,4],[17,15,18,16],[20,15,21,16],[20,9,20,14],[37,15,37,16],[38,15,38,16],[39,15,39,16],[40,15,40,16],[35,15,35,16],[43,3,43,16],[2,1,2,17],[36,15,36,16],[22,15,22,16],[23,15,23,16],[24,15,24,16],[25,15,25,16],[26,15,26,16],[27,15,27,16],[28,15,28,16],[29,15,29,16],[30,15,30,16],[20,2,41,2],[41,15,41,16],[16,12,16,14],[17,12,18,14],[20,7,20,8],[20,3,21,3],[20,4,21,4],[20,5,21,5],[20,6,21,6]]}
[]
[]
[null,"令和６年度アートフェスタ－愛知県高等学校総合文化祭－係り生徒報告書"]
[]
[null,null,"この報告に基づき、係り生徒の委嘱をしますので、専門部、各学校で相談の上、本人の内諾を得て報告してください。"]
[]
[]
[null,null,"提出方法","①","学校名を選択した後、必要事項を記入してください。"]
[]
[null,null,null,"②","ファイル名を「高文連ID」+｢学校名略称.xlsm」としてください。（例：「101旭丘.xlsm｣)"]
[]
[null,null,null,"③","メール添付にて事務局までご提出ください（件名を「係り生徒報告書」としてください。）"]
[]
[null,null,"提出先：","愛知高文連事務局：",null,"aikoubun@aroma.ocn.ne.jp",null,null,null,null,null,null,null,null,null,null,"締切：令和6年6月14日（金）  "]
[]
[]
[null,null,"学校名",null,null,null,null,null,null,null,null,null,"係名\n(リストから\n選択)",null,null,null,null,null,null,"令和５年度メモ：集計方法の変更に伴い、学校名と係り名の集約を略称に変更"]
[null,null,"高文連ID",{"$f":"IF(D17=\"\",\"(未入力)\",VLOOKUP(D17,ID!A1:B300,2,FALSE))","v":"(未入力)"},null,"TEL:",{"$f":"IF(D17=\"\",\"(未入力)\",VLOOKUP(D17,ID!A1:C300,3,FALSE))","v":"(未入力)"},null,null,null,null,null,"専門部名\n(リストから\n選択)"]
[null,null,"記載責任者\n職名",null,null,"記載責任者\n氏名"]
[]
{"$rows_left_out":28}
{"sheet":"ID","index":1,"n_rows":278,"n_cols":6,"rows_kept":278,"cut":false,"hidden":false,"merged":[]}
["学校名","ID","電話番号","略称","制作メモ","略称"]
["愛知県立旭丘高等学校",101,"052-721-5351","旭丘",null,"旭丘"]
["愛知県立明和高等学校",102,"052-961-2551","明和","セルの書式設定で「表示しない」になっていると、検索対象とならない","明和"]
["愛知県立明和高等学校(定時制)",103,"052-961-2551","明和〔定〕","　当然のことのように思えるが、この場合でもセルには表示されることがあるため、混乱のもとになる","明和〔定〕"]
["愛知県立千種高等学校",104,"052-771-2121","千種",null,"千種"]
["愛知県立守山高等学校",105,"052-736-3500","守山",null,"守山"]
["愛知県立名古屋西高等学校",106,"052-524-5175","名古屋西",null,"名古屋西"]
["愛知県立名古屋西高等学校(定時制)",107,"052-522-2451","名古屋西〔定〕",null,"名古屋西〔定〕"]
["愛知県立城北つばさ高等学校(昼間部)",108,"052-911-4421","城北つばさ〔昼間〕",null,"城北つばさ〔昼間〕"]
["愛知県立城北つばさ高等学校(夜間部)",109,"052-911-4421","城北つばさ〔夜間〕",null,"城北つばさ〔夜間〕"]
["愛知県立旭陵高等学校",110,"052-721-5371","旭陵",null,"旭陵"]
["愛知県立緑丘高等学校",111,"052-791-8226","緑丘",null,"緑丘"]
["愛知県立愛知総合工科高等学校",112,"052-788-2020","愛知総合工科",null,"愛知総合工科"]
["愛知県立愛知商業高等学校",113,"052-935-3480","愛知商業",null,"愛知商業"]
["愛知県立瀬戸高等学校",114,"0561-82-7710","瀬戸",null,"瀬戸"]
["愛知県立瀬戸西高等学校",115,"0561-84-7400","瀬戸西",null,"瀬戸西"]
["愛知県立瀬戸北総合高等学校",116,"0561-48-1500","瀬戸北総合",null,"瀬戸北総合"]
["愛知県立瀬戸工科高等学校",117,"0561-82-2003","瀬戸工科",null,"瀬戸工科"]
["愛知県立瀬戸工科高等学校(定時制)",118,"0561-82-2003","瀬戸工科〔定〕",null,"瀬戸工科〔定〕"]
["愛知県立春日井高等学校",119,"0568-81-2251","春日井",null,"春日井"]
{"$rows_left_out":259}
{"sheet":"集約","index":2,"n_rows":30,"n_cols":19,"rows_kept":30,"cut":false,"hidden":true,"merged":[]}
[{"$f":"IF(記入!E23=\"\",\"\",VLOOKUP(記入!$P$17,係りリスト,2,FALSE))","v":""},{"$f":"IF(記入!E23=\"\",\"\",記入!$P$18)","v":""},{"$f":"IF(記入!E23=\"\",\"\",記入!$D$18)","v":""},{"$f":"IF(記入!E23=\"\",\"\",VLOOKUP(記入!$D$17,ID!$A$2:$F$300,4,FALSE))","v":""},{"$f":"IF(記入!E23=\"\",\"\",記入!$D$19)","v":""},{"$f":"IF(記入!E23=\"\",\"\",記入!$G$19)","v":""},{"$f":"IF(記入!D23=\"\",\"\",記入!D23)","v":""},{"$f":"IF(記入!E23=\"\",\"\",記入!E23)","v":""},{"$f":"IF(記入!F23=\"\",\"\",記入!F23)","v":""},{"$f":"IF(記入!G23=\"\",\"\",記入!G23)","v":""},{"$f":"IF(記入!H23=\"\",\"\",記入!H23)","v":""},{"$f":"IF(記入!I23=\"\",\"\",記入!I23)","v":""},{"$f":"IF(記入!J23=\"\",\"\",記入!J23)","v":""},{"$f":"IF(記入!K23=\"\",\"\",記入!K23)","v":""},{"$f":"IF(記入!L23=\"\",\"\",記入!L23)","v":""},{"$f":"IF(記入!M23=\"\",\"\",記入!M23)","v":""},{"$f":"IF(記入!N23=\"\",\"\",記入!N23)","v":""},{"$f":"IF(記入!O23=\"\",\"\",記入!O23)","v":""},{"$f":"IF(記入!P23=\"\",\"\",記入!P23)&IF(記入!D44=\"\",\"\",\"(連絡欄有)\")","v":""}]
[{"$f":"IF(記入!E24=\"\",\"\",VLOOKUP(記入!$P$17,係りリスト,2,FALSE))","v":""},{"$f":"IF(記入!E24=\"\",\"\",記入!$P$18)","v":""},{"$f":"IF(記入!E24=\"\",\"\",記入!$D$18)","v":""},{"$f":"IF(記入!E24=\"\",\"\",VLOOKUP(記入!$D$17,ID!$A$2:$F$300,4,FALSE))","v":""},{"$f":"IF(記入!E24=\"\",\"\",記入!$D$19)","v":""},{"$f":"IF(記入!E24=\"\",\"\",記入!$G$19)","v":""},{"$f":"IF(記入!D24=\"\",\"\",記入!D24)","v":""},{"$f":"IF(記入!E24=\"\",\"\",記入!E24)","v":""},{"$f":"IF(記入!F24=\"\",\"\",記入!F24)","v":""},{"$f":"IF(記入!G24=\"\",\"\",記入!G24)","v":""},{"$f":"IF(記入!H24=\"\",\"\",記入!H24)","v":""},{"$f":"IF(記入!I24=\"\",\"\",記入!I24)","v":""},{"$f":"IF(記入!J24=\"\",\"\",記入!J24)","v":""},{"$f":"IF(記入!K24=\"\",\"\",記入!K24)","v":""},{"$f":"IF(記入!L24=\"\",\"\",記入!L24)","v":""},{"$f":"IF(記入!M24=\"\",\"\",記入!M24)","v":""},{"$f":"IF(記入!N24=\"\",\"\",記入!N24)","v":""},{"$f":"IF(記入!O24=\"\",\"\",記入!O24)","v":""},{"$f":"IF(記入!P24=\"\",\"\",記入!P24)&IF(記入!D45=\"\",\"\",\"(連絡欄有)\")","v":""}]
[{"$f":"IF(記入!E25=\"\",\"\",VLOOKUP(記入!$P$17,係りリスト,2,FALSE))","v":""},{"$f":"IF(記入!E25=\"\",\"\",記入!$P$18)","v":""},{"$f":"IF(記入!E25=\"\",\"\",記入!$D$18)","v":""},{"$f":"IF(記入!E25=\"\",\"\",VLOOKUP(記入!$D$17,ID!$A$2:$F$300,4,FALSE))","v":""},{"$f":"IF(記入!E25=\"\",\"\",記入!$D$19)","v":""},{"$f":"IF(記入!E25=\"\",\"\",記入!$G$19)","v":""},{"$f":"IF(記入!D25=\"\",\"\",記入!D25)","v":""},{"$f":"IF(記入!E25=\"\",\"\",記入!E25)","v":""},{"$f":"IF(記入!F25=\"\",\"\",記入!F25)","v":""},{"$f":"IF(記入!G25=\"\",\"\",記入!G25)","v":""},{"$f":"IF(記入!H25=\"\",\"\",記入!H25)","v":""},{"$f":"IF(記入!I25=\"\",\"\",記入!I25)","v":""},{"$f":"IF(記入!J25=\"\",\"\",記入!J25)","v":""},{"$f":"IF(記入!K25=\"\",\"\",記入!K25)","v":""},{"$f":"IF(記入!L25=\"\",\"\",記入!L25)","v":""},{"$f":"IF(記入!M25=\"\",\"\",記入!M25)","v":""},{"$f":"IF(記入!N25=\"\",\"\",記入!N25)","v":""},{"$f":"IF(記入!O25=\"\",\"\",記入!O25)","v":""},{"$f":"IF(記入!P25=\"\",\"\",記入!P25)&IF(記入!D46=\"\",\"\",\"(連絡欄有)\")","v":""}]
[{"$f":"IF(記入!E26=\"\",\"\",VLOOKUP(記入!$P$17,係りリスト,2,FALSE))","v":""},{"$f":"IF(記入!E26=\"\",\"\",記入!$P$18)","v":""},{"$f":"IF(記入!E26=\"\",\"\",記入!$D$18)","v":""},{"$f":"IF(記入!E26=\"\",\"\",VLOOKUP(記入!$D$17,ID!$A$2:$F$300,4,FALSE))","v":""},{"$f":"IF(記入!E26=\"\",\"\",記入!$D$19)","v":""},{"$f":"IF(記入!E26=\"\",\"\",記入!$G$19)","v":""},{"$f":"IF(記入!D26=\"\",\"\",記入!D26)","v":""},{"$f":"IF(記入!E26=\"\",\"\",記入!E26)","v":""},{"$f":"IF(記入!F26=\"\",\"\",記入!F26)","v":""},{"$f":"IF(記入!G26=\"\",\"\",記入!G26)","v":""},{"$f":"IF(記入!H26=\"\",\"\",記入!H26)","v":""},{"$f":"IF(記入!I26=\"\",\"\",記入!I26)","v":""},{"$f":"IF(記入!J26=\"\",\"\",記入!J26)","v":""},{"$f":"IF(記入!K26=\"\",\"\",記入!K26)","v":""},{"$f":"IF(記入!L26=\"\",\"\",記入!L26)","v":""},{"$f":"IF(記入!M26=\"\",\"\",記入!M26)","v":""},{"$f":"IF(記入!N26=\"\",\"\",記入!N26)","v":""},{"$f":"IF(記入!O26=\"\",\"\",記入!O26)","v":""},{"$f":"IF(記入!P26=\"\",\"\",記入!P26)&IF(記入!D47=\"\",\"\",\"(連絡欄有)\")","v":""}]
[{"$f":"IF(記入!E27=\"\",\"\",VLOOKUP(記入!$P$17,係りリスト,2,FALSE))","v":""},{"$f":"IF(記入!E27=\"\",\"\",記入!$P$18)","v":""},{"$f":"IF(記入!E27=\"\",\"\",記入!$D$18)","v":""},{"$f":"IF(記入!E27=\"\",\"\",VLOOKUP(記入!$D$17,ID!$A$2:$F$300,4,FALSE))","v":""},{"$f":"IF(記入!E27=\"\",\"\",記入!$D$19)","v":""},{"$f":"IF(記入!E27=\"\",\"\",記入!$G$19)","v":""},{"$f":"IF(記入!D27=\"\",\"\",記入!D27)","v":""},{"$f":"IF(記入!E27=\"\",\"\",記入!E27)","v":""},{"$f":"IF(記入!F27=\"\",\"\",記入!F27)","v":""},{"$f":"IF(記入!G27=\"\",\"\",記入!G27)","v":""},{"$f":"IF(記入!H27=\"\",\"\",記入!H27)","v":""},{"$f":"IF(記入!I27=\"\",\"\",記入!I27)","v":""},{"$f":"IF(記入!J27=\"\",\"\",記入!J27)","v":""},{"$f":"IF(記入!K27=\"\",\"\",記入!K27)","v":""},{"$f":"IF(記入!L27=\"\",\"\",記入!L27)","v":""},{"$f":"IF(記入!M27=\"\",\"\",記入!M27)","v":""},{"$f":"IF(記入!N27=\"\",\"\",記入!N27)","v":""},{"$f":"IF(記入!O27=\"\",\"\",記入!O27)","v":""},{"$f":"IF(記入!P27=\"\",\"\",記入!P27)&IF(記入!D48=\"\",\"\",\"(連絡欄有)\")","v":""}]
[{"$f":"IF(記入!E28=\"\",\"\",VLOOKUP(記入!$P$17,係りリスト,2,FALSE))","v":""},{"$f":"IF(記入!E28=\"\",\"\",記入!$P$18)","v":""},{"$f":"IF(記入!E28=\"\",\"\",記入!$D$18)","v":""},{"$f":"IF(記入!E28=\"\",\"\",VLOOKUP(記入!$D$17,ID!$A$2:$F$300,4,FALSE))","v":""},{"$f":"IF(記入!E28=\"\",\"\",記入!$D$19)","v":""},{"$f":"IF(記入!E28=\"\",\"\",記入!$G$19)","v":""},{"$f":"IF(記入!D28=\"\",\"\",記入!D28)","v":""},{"$f":"IF(記入!E28=\"\",\"\",記入!E28)","v":""},{"$f":"IF(記入!F28=\"\",\"\",記入!F28)","v":""},{"$f":"IF(記入!G28=\"\",\"\",記入!G28)","v":""},{"$f":"IF(記入!H28=\"\",\"\",記入!H28)","v":""},{"$f":"IF(記入!I28=\"\",\"\",記入!I28)","v":""},{"$f":"IF(記入!J28=\"\",\"\",記入!J28)","v":""},{"$f":"IF(記入!K28=\"\",\"\",記入!K28)","v":""},{"$f":"IF(記入!L28=\"\",\"\",記入!L28)","v":""},{"$f":"IF(記入!M28=\"\",\"\",記入!M28)","v":""},{"$f":"IF(記入!N28=\"\",\"\",記入!N28)","v":""},{"$f":"IF(記入!O28=\"\",\"\",記入!O28)","v":""},{"$f":"IF(記入!P28=\"\",\"\",記入!P28)&IF(記入!D49=\"\",\"\",\"(連絡欄有)\")","v":""}]
[{"$f":"IF(記入!E29=\"\",\"\",VLOOKUP(記入!$P$17,係りリスト,2,FALSE))","v":""},{"$f":"IF(記入!E29=\"\",\"\",記入!$P$18)","v":""},{"$f":"IF(記入!E29=\"\",\"\",記入!$D$18)","v":""},{"$f":"IF(記入!E29=\"\",\"\",VLOOKUP(記入!$D$17,ID!$A$2:$F$300,4,FALSE))","v":""},{"$f":"IF(記入!E29=\"\",\"\",記入!$D$19)","v":""},{"$f":"IF(記入!E29=\"\",\"\",記入!$G$19)","v":""},{"$f":"IF(記入!D29=\"\",\"\",記入!D29)","v":""},{"$f":"IF(記入!E29=\"\",\"\",記入!E29)","v":""},{"$f":"IF(記入!F29=\"\",\"\",記入!F29)","v":""},{"$f":"IF(記入!G29=\"\",\"\",記入!G29)","v":""},{"$f":"IF(記入!H29=\"\",\"\",記入!H29)","v":""},{"$f":"IF(記入!I29=\"\",\"\",記入!I29)","v":""},{"$f":"IF(記入!J29=\"\",\"\",記入!J29)","v":""},{"$f":"IF(記入!K29=\"\",\"\",記入!K29)","v":""},{"$f":"IF(記入!L29=\"\",\"\",記入!L29)","v":""},{"$f":"IF(記入!M29=\"\",\"\",記入!M29)","v":""},{"$f":"IF(記入!N29=\"\",\"\",記入!N29)","v":""},{"$f":"IF(記入!O29=\"\",\"\",記入!O29)","v":""},{"$f":"IF(記入!P29=\"\",\"\",記入!P29)&IF(記入!D50=\"\",\"\",\"(連絡欄有)\")","v":""}]
[{"$f":"IF(記入!E30=\"\",\"\",VLOOKUP(記入!$P$17,係りリスト,2,FALSE))","v":""},{"$f":"IF(記入!E30=\"\",\"\",記入!$P$18)","v":""},{"$f":"IF(記入!E30=\"\",\"\",記入!$D$18)","v":""},{"$f":"IF(記入!E30=\"\",\"\",VLOOKUP(記入!$D$17,ID!$A$2:$F$300,4,FALSE))","v":""},{"$f":"IF(記入!E30=\"\",\"\",記入!$D$19)","v":""},{"$f":"IF(記入!E30=\"\",\"\",記入!$G$19)","v":""},{"$f":"IF(記入!D30=\"\",\"\",記入!D30)","v":""},{"$f":"IF(記入!E30=\"\",\"\",記入!E30)","v":""},{"$f":"IF(記入!F30=\"\",\"\",記入!F30)","v":""},{"$f":"IF(記入!G30=\"\",\"\",記入!G30)","v":""},{"$f":"IF(記入!H30=\"\",\"\",記入!H30)","v":""},{"$f":"IF(記入!I30=\"\",\"\",記入!I30)","v":""},{"$f":"IF(記入!J30=\"\",\"\",記入!J30)","v":""},{"$f":"IF(記入!K30=\"\",\"\",記入!K30)","v":""},{"$f":"IF(記入!L30=\"\",\"\",記入!L30)","v":""},{"$f":"IF(記入!M30=\"\",\"\",記入!M30)","v":""},{"$f":"IF(記入!N30=\"\",\"\",記入!N30)","v":""},{"$f":"IF(記入!O30=\"\",\"\",記入!O30)","v":""},{"$f":"IF(記入!P30=\"\",\"\",記入!P30)&IF(記入!D51=\"\",\"\",\"(連絡欄有)\")","v":""}]
[{"$f":"IF(記入!E31=\"\",\"\",VLOOKUP(記入!$P$17,係りリスト,2,FALSE))","v":""},{"$f":"IF(記入!E31=\"\",\"\",記入!$P$18)","v":""},{"$f":"IF(記入!E31=\"\",\"\",記入!$D$18)","v":""},{"$f":"IF(記入!E31=\"\",\"\",VLOOKUP(記入!$D$17,ID!$A$2:$F$300,4,FALSE))","v":""},{"$f":"IF(記入!E31=\"\",\"\",記入!$D$19)","v":""},{"$f":"IF(記入!E31=\"\",\"\",記入!$G$19)","v":""},{"$f":"IF(記入!D31=\"\",\"\",記入!D31)","v":""},{"$f":"IF(記入!E31=\"\",\"\",記入!E31)","v":""},{"$f":"IF(記入!F31=\"\",\"\",記入!F31)","v":""},{"$f":"IF(記入!G31=\"\",\"\",記入!G31)","v":""},{"$f":"IF(記入!H31=\"\",\"\",記入!H31)","v":""},{"$f":"IF(記入!I31=\"\",\"\",記入!I31)","v":""},{"$f":"IF(記入!J31=\"\",\"\",記入!J31)","v":""},{"$f":"IF(記入!K31=\"\",\"\",記入!K31)","v":""},{"$f":"IF(記入!L31=\"\",\"\",記入!L31)","v":""},{"$f":"IF(記入!M31=\"\",\"\",記入!M31)","v":""},{"$f":"IF(記入!N31=\"\",\"\",記入!N31)","v":""},{"$f":"IF(記入!O31=\"\",\"\",記入!O31)","v":""},{"$f":"IF(記入!P31=\"\",\"\",記入!P31)&IF(記入!D52=\"\",\"\",\"(連絡欄有)\")","v":""}]
[{"$f":"IF(記入!E32=\"\",\"\",VLOOKUP(記入!$P$17,係りリスト,2,FALSE))","v":""},{"$f":"IF(記入!E32=\"\",\"\",記入!$P$18)","v":""},{"$f":"IF(記入!E32=\"\",\"\",記入!$D$18)","v":""},{"$f":"IF(記入!E32=\"\",\"\",VLOOKUP(記入!$D$17,ID!$A$2:$F$300,4,FALSE))","v":""},{"$f":"IF(記入!E32=\"\",\"\",記入!$D$19)","v":""},{"$f":"IF(記入!E32=\"\",\"\",記入!$G$19)","v":""},{"$f":"IF(記入!D32=\"\",\"\",記入!D32)","v":""},{"$f":"IF(記入!E32=\"\",\"\",記入!E32)","v":""},{"$f":"IF(記入!F32=\"\",\"\",記入!F32)","v":""},{"$f":"IF(記入!G32=\"\",\"\",記入!G32)","v":""},{"$f":"IF(記入!H32=\"\",\"\",記入!H32)","v":""},{"$f":"IF(記入!I32=\"\",\"\",記入!I32)","v":""},{"$f":"IF(記入!J32=\"\",\"\",記入!J32)","v":""},{"$f":"IF(記入!K32=\"\",\"\",記入!K32)","v":""},{"$f":"IF(記入!L32=\"\",\"\",記入!L32)","v":""},{"$f":"IF(記入!M32=\"\",\"\",記入!M32)","v":""},{"$f":"IF(記入!N32=\"\",\"\",記入!N32)","v":""},{"$f":"IF(記入!O32=\"\",\"\",記入!O32)","v":""},{"$f":"IF(記入!P32=\"\",\"\",記入!P32)&IF(記入!D53=\"\",\"\",\"(連絡欄有)\")","v":""}]
[{"$f":"IF(記入!E33=\"\",\"\",VLOOKUP(記入!$P$17,係りリスト,2,FALSE))","v":""},{"$f":"IF(記入!E33=\"\",\"\",記入!$P$18)","v":""},{"$f":"IF(記入!E33=\"\",\"\",記入!$D$18)","v":""},{"$f":"IF(記入!E33=\"\",\"\",VLOOKUP(記入!$D$17,ID!$A$2:$F$300,4,FALSE))","v":""},{"$f":"IF(記入!E33=\"\",\"\",記入!$D$19)","v":""},{"$f":"IF(記入!E33=\"\",\"\",記入!$G$19)","v":""},{"$f":"IF(記入!D33=\"\",\"\",記入!D33)","v":""},{"$f":"IF(記入!E33=\"\",\"\",記入!E33)","v":""},{"$f":"IF(記入!F33=\"\",\"\",記入!F33)","v":""},{"$f":"IF(記入!G33=\"\",\"\",記入!G33)","v":""},{"$f":"IF(記入!H33=\"\",\"\",記入!H33)","v":""},{"$f":"IF(記入!I33=\"\",\"\",記入!I33)","v":""},{"$f":"IF(記入!J33=\"\",\"\",記入!J33)","v":""},{"$f":"IF(記入!K33=\"\",\"\",記入!K33)","v":""},{"$f":"IF(記入!L33=\"\",\"\",記入!L33)","v":""},{"$f":"IF(記入!M33=\"\",\"\",記入!M33)","v":""},{"$f":"IF(記入!N33=\"\",\"\",記入!N33)","v":""},{"$f":"IF(記入!O33=\"\",\"\",記入!O33)","v":""},{"$f":"IF(記入!P33=\"\",\"\",記入!P33)&IF(記入!D54=\"\",\"\",\"(連絡欄有)\")","v":""}]
[{"$f":"IF(記入!E34=\"\",\"\",VLOOKUP(記入!$P$17,係りリスト,2,FALSE))","v":""},{"$f":"IF(記入!E34=\"\",\"\",記入!$P$18)","v":""},{"$f":"IF(記入!E34=\"\",\"\",記入!$D$18)","v":""},{"$f":"IF(記入!E34=\"\",\"\",VLOOKUP(記入!$D$17,ID!$A$2:$F$300,4,FALSE))","v":""},{"$f":"IF(記入!E34=\"\",\"\",記入!$D$19)","v":""},{"$f":"IF(記入!E34=\"\",\"\",記入!$G$19)","v":""},{"$f":"IF(記入!D34=\"\",\"\",記入!D34)","v":""},{"$f":"IF(記入!E34=\"\",\"\",記入!E34)","v":""},{"$f":"IF(記入!F34=\"\",\"\",記入!F34)","v":""},{"$f":"IF(記入!G34=\"\",\"\",記入!G34)","v":""},{"$f":"IF(記入!H34=\"\",\"\",記入!H34)","v":""},{"$f":"IF(記入!I34=\"\",\"\",記入!I34)","v":""},{"$f":"IF(記入!J34=\"\",\"\",記入!J34)","v":""},{"$f":"IF(記入!K34=\"\",\"\",記入!K34)","v":""},{"$f":"IF(記入!L34=\"\",\"\",記入!L34)","v":""},{"$f":"IF(記入!M34=\"\",\"\",記入!M34)","v":""},{"$f":"IF(記入!N34=\"\",\"\",記入!N34)","v":""},{"$f":"IF(記入!O34=\"\",\"\",記入!O34)","v":""},{"$f":"IF(記入!P34=\"\",\"\",記入!P34)&IF(記入!D55=\"\",\"\",\"(連絡欄有)\")","v":""}]
[{"$f":"IF(記入!E35=\"\",\"\",VLOOKUP(記入!$P$17,係りリスト,2,FALSE))","v":""},{"$f":"IF(記入!E35=\"\",\"\",記入!$P$18)","v":""},{"$f":"IF(記入!E35=\"\",\"\",記入!$D$18)","v":""},{"$f":"IF(記入!E35=\"\",\"\",VLOOKUP(記入!$D$17,ID!$A$2:$F$300,4,FALSE))","v":""},{"$f":"IF(記入!E35=\"\",\"\",記入!$D$19)","v":""},{"$f":"IF(記入!E35=\"\",\"\",記入!$G$19)","v":""},{"$f":"IF(記入!D35=\"\",\"\",記入!D35)","v":""},{"$f":"IF(記入!E35=\"\",\"\",記入!E35)","v":""},{"$f":"IF(記入!F35=\"\",\"\",記入!F35)","v":""},{"$f":"IF(記入!G35=\"\",\"\",記入!G35)","v":""},{"$f":"IF(記入!H35=\"\",\"\",記入!H35)","v":""},{"$f":"IF(記入!I35=\"\",\"\",記入!I35)","v":""},{"$f":"IF(記入!J35=\"\",\"\",記入!J35)","v":""},{"$f":"IF(記入!K35=\"\",\"\",記入!K35)","v":""},{"$f":"IF(記入!L35=\"\",\"\",記入!L35)","v":""},{"$f":"IF(記入!M35=\"\",\"\",記入!M35)","v":""},{"$f":"IF(記入!N35=\"\",\"\",記入!N35)","v":""},{"$f":"IF(記入!O35=\"\",\"\",記入!O35)","v":""},{"$f":"IF(記入!P35=\"\",\"\",記入!P35)&IF(記入!D56=\"\",\"\",\"(連絡欄有)\")","v":""}]
[{"$f":"IF(記入!E36=\"\",\"\",VLOOKUP(記入!$P$17,係りリスト,2,FALSE))","v":""},{"$f":"IF(記入!E36=\"\",\"\",記入!$P$18)","v":""},{"$f":"IF(記入!E36=\"\",\"\",記入!$D$18)","v":""},{"$f":"IF(記入!E36=\"\",\"\",VLOOKUP(記入!$D$17,ID!$A$2:$F$300,4,FALSE))","v":""},{"$f":"IF(記入!E36=\"\",\"\",記入!$D$19)","v":""},{"$f":"IF(記入!E36=\"\",\"\",記入!$G$19)","v":""},{"$f":"IF(記入!D36=\"\",\"\",記入!D36)","v":""},{"$f":"IF(記入!E36=\"\",\"\",記入!E36)","v":""},{"$f":"IF(記入!F36=\"\",\"\",記入!F36)","v":""},{"$f":"IF(記入!G36=\"\",\"\",記入!G36)","v":""},{"$f":"IF(記入!H36=\"\",\"\",記入!H36)","v":""},{"$f":"IF(記入!I36=\"\",\"\",記入!I36)","v":""},{"$f":"IF(記入!J36=\"\",\"\",記入!J36)","v":""},{"$f":"IF(記入!K36=\"\",\"\",記入!K36)","v":""},{"$f":"IF(記入!L36=\"\",\"\",記入!L36)","v":""},{"$f":"IF(記入!M36=\"\",\"\",記入!M36)","v":""},{"$f":"IF(記入!N36=\"\",\"\",記入!N36)","v":""},{"$f":"IF(記入!O36=\"\",\"\",記入!O36)","v":""},{"$f":"IF(記入!P36=\"\",\"\",記入!P36)&IF(記入!D57=\"\",\"\",\"(連絡欄有)\")","v":""}]
[{"$f":"IF(記入!E37=\"\",\"\",VLOOKUP(記入!$P$17,係りリスト,2,FALSE))","v":""},{"$f":"IF(記入!E37=\"\",\"\",記入!$P$18)","v":""},{"$f":"IF(記入!E37=\"\",\"\",記入!$D$18)","v":""},{"$f":"IF(記入!E37=\"\",\"\",VLOOKUP(記入!$D$17,ID!$A$2:$F$300,4,FALSE))","v":""},{"$f":"IF(記入!E37=\"\",\"\",記入!$D$19)","v":""},{"$f":"IF(記入!E37=\"\",\"\",記入!$G$19)","v":""},{"$f":"IF(記入!D37=\"\",\"\",記入!D37)","v":""},{"$f":"IF(記入!E37=\"\",\"\",記入!E37)","v":""},{"$f":"IF(記入!F37=\"\",\"\",記入!F37)","v":""},{"$f":"IF(記入!G37=\"\",\"\",記入!G37)","v":""},{"$f":"IF(記入!H37=\"\",\"\",記入!H37)","v":""},{"$f":"IF(記入!I37=\"\",\"\",記入!I37)","v":""},{"$f":"IF(記入!J37=\"\",\"\",記入!J37)","v":""},{"$f":"IF(記入!K37=\"\",\"\",記入!K37)","v":""},{"$f":"IF(記入!L37=\"\",\"\",記入!L37)","v":""},{"$f":"IF(記入!M37=\"\",\"\",記入!M37)","v":""},{"$f":"IF(記入!N37=\"\",\"\",記入!N37)","v":""},{"$f":"IF(記入!O37=\"\",\"\",記入!O37)","v":""},{"$f":"IF(記入!P37=\"\",\"\",記入!P37)&IF(記入!D58=\"\",\"\",\"(連絡欄有)\")","v":""}]
[{"$f":"IF(記入!E38=\"\",\"\",VLOOKUP(記入!$P$17,係りリスト,2,FALSE))","v":""},{"$f":"IF(記入!E38=\"\",\"\",記入!$P$18)","v":""},{"$f":"IF(記入!E38=\"\",\"\",記入!$D$18)","v":""},{"$f":"IF(記入!E38=\"\",\"\",VLOOKUP(記入!$D$17,ID!$A$2:$F$300,4,FALSE))","v":""},{"$f":"IF(記入!E38=\"\",\"\",記入!$D$19)","v":""},{"$f":"IF(記入!E38=\"\",\"\",記入!$G$19)","v":""},{"$f":"IF(記入!D38=\"\",\"\",記入!D38)","v":""},{"$f":"IF(記入!E38=\"\",\"\",記入!E38)","v":""},{"$f":"IF(記入!F38=\"\",\"\",記入!F38)","v":""},{"$f":"IF(記入!G38=\"\",\"\",記入!G38)","v":""},{"$f":"IF(記入!H38=\"\",\"\",記入!H38)","v":""},{"$f":"IF(記入!I38=\"\",\"\",記入!I38)","v":""},{"$f":"IF(記入!J38=\"\",\"\",記入!J38)","v":""},{"$f":"IF(記入!K38=\"\",\"\",記入!K38)","v":""},{"$f":"IF(記入!L38=\"\",\"\",記入!L38)","v":""},{"$f":"IF(記入!M38=\"\",\"\",記入!M38)","v":""},{"$f":"IF(記入!N38=\"\",\"\",記入!N38)","v":""},{"$f":"IF(記入!O38=\"\",\"\",記入!O38)","v":""},{"$f":"IF(記入!P38=\"\",\"\",記入!P38)&IF(記入!D59=\"\",\"\",\"(連絡欄有)\")","v":""}]
[{"$f":"IF(記入!E39=\"\",\"\",VLOOKUP(記入!$P$17,係りリスト,2,FALSE))","v":""},{"$f":"IF(記入!E39=\"\",\"\",記入!$P$18)","v":""},{"$f":"IF(記入!E39=\"\",\"\",記入!$D$18)","v":""},{"$f":"IF(記入!E39=\"\",\"\",VLOOKUP(記入!$D$17,ID!$A$2:$F$300,4,FALSE))","v":""},{"$f":"IF(記入!E39=\"\",\"\",記入!$D$19)","v":""},{"$f":"IF(記入!E39=\"\",\"\",記入!$G$19)","v":""},{"$f":"IF(記入!D39=\"\",\"\",記入!D39)","v":""},{"$f":"IF(記入!E39=\"\",\"\",記入!E39)","v":""},{"$f":"IF(記入!F39=\"\",\"\",記入!F39)","v":""},{"$f":"IF(記入!G39=\"\",\"\",記入!G39)","v":""},{"$f":"IF(記入!H39=\"\",\"\",記入!H39)","v":""},{"$f":"IF(記入!I39=\"\",\"\",記入!I39)","v":""},{"$f":"IF(記入!J39=\"\",\"\",記入!J39)","v":""},{"$f":"IF(記入!K39=\"\",\"\",記入!K39)","v":""},{"$f":"IF(記入!L39=\"\",\"\",記入!L39)","v":""},{"$f":"IF(記入!M39=\"\",\"\",記入!M39)","v":""},{"$f":"IF(記入!N39=\"\",\"\",記入!N39)","v":""},{"$f":"IF(記入!O39=\"\",\"\",記入!O39)","v":""},{"$f":"IF(記入!P39=\"\",\"\",記入!P39)&IF(記入!D60=\"\",\"\",\"(連絡欄有)\")","v":""}]
[{"$f":"IF(記入!E40=\"\",\"\",VLOOKUP(記入!$P$17,係りリスト,2,FALSE))","v":""},{"$f":"IF(記入!E40=\"\",\"\",記入!$P$18)","v":""},{"$f":"IF(記入!E40=\"\",\"\",記入!$D$18)","v":""},{"$f":"IF(記入!E40=\"\",\"\",VLOOKUP(記入!$D$17,ID!$A$2:$F$300,4,FALSE))","v":""},{"$f":"IF(記入!E40=\"\",\"\",記入!$D$19)","v":""},{"$f":"IF(記入!E40=\"\",\"\",記入!$G$19)","v":""},{"$f":"IF(記入!D40=\"\",\"\",記入!D40)","v":""},{"$f":"IF(記入!E40=\"\",\"\",記入!E40)","v":""},{"$f":"IF(記入!F40=\"\",\"\",記入!F40)","v":""},{"$f":"IF(記入!G40=\"\",\"\",記入!G40)","v":""},{"$f":"IF(記入!H40=\"\",\"\",記入!H40)","v":""},{"$f":"IF(記入!I40=\"\",\"\",記入!I40)","v":""},{"$f":"IF(記入!J40=\"\",\"\",記入!J40)","v":""},{"$f":"IF(記入!K40=\"\",\"\",記入!K40)","v":""},{"$f":"IF(記入!L40=\"\",\"\",記入!L40)","v":""},{"$f":"IF(記入!M40=\"\",\"\",記入!M40)","v":""},{"$f":"IF(記入!N40=\"\",\"\",記入!N40)","v":""},{"$f":"IF(記入!O40=\"\",\"\",記入!O40)","v":""},{"$f":"IF(記入!P40=\"\",\"\",記入!P40)&IF(記入!D61=\"\",\"\",\"(連絡欄有)\")","v":""}]
[{"$f":"IF(記入!E41=\"\",\"\",VLOOKUP(記入!$P$17,係りリスト,2,FALSE))","v":""},{"$f":"IF(記入!E41=\"\",\"\",記入!$P$18)","v":""},{"$f":"IF(記入!E41=\"\",\"\",記入!$D$18)","v":""},{"$f":"IF(記入!E41=\"\",\"\",VLOOKUP(記入!$D$17,ID!$A$2:$F$300,4,FALSE))","v":""},{"$f":"IF(記入!E41=\"\",\"\",記入!$D$19)","v":""},{"$f":"IF(記入!E41=\"\",\"\",記入!$G$19)","v":""},{"$f":"IF(記入!D41=\"\",\"\",記入!D41)","v":""},{"$f":"IF(記入!E41=\"\",\"\",記入!E41)","v":""},{"$f":"IF(記入!F41=\"\",\"\",記入!F41)","v":""},{"$f":"IF(記入!G41=\"\",\"\",記入!G41)","v":""},{"$f":"IF(記入!H41=\"\",\"\",記入!H41)","v":""},{"$f":"IF(記入!I41=\"\",\"\",記入!I41)","v":""},{"$f":"IF(記入!J41=\"\",\"\",記入!J41)","v":""},{"$f":"IF(記入!K41=\"\",\"\",記入!K41)","v":""},{"$f":"IF(記入!L41=\"\",\"\",記入!L41)","v":""},{"$f":"IF(記入!M41=\"\",\"\",記入!M41)","v":""},{"$f":"IF(記入!N41=\"\",\"\",記入!N41)","v":""},{"$f":"IF(記入!O41=\"\",\"\",記入!O41)","v":""},{"$f":"IF(記入!P41=\"\",\"\",記入!P41)&IF(記入!D62=\"\",\"\",\"(連絡欄有)\")","v":""}]
[{"$f":"IF(記入!E42=\"\",\"\",VLOOKUP(記入!$P$17,係りリスト,2,FALSE))","v":""},{"$f":"IF(記入!E42=\"\",\"\",記入!$P$18)","v":""},{"$f":"IF(記入!E42=\"\",\"\",記入!$D$18)","v":""},{"$f":"IF(記入!E42=\"\",\"\",VLOOKUP(記入!$D$17,ID!$A$2:$F$300,4,FALSE))","v":""},{"$f":"IF(記入!E42=\"\",\"\",記入!$D$19)","v":""},{"$f":"IF(記入!E42=\"\",\"\",記入!$G$19)","v":""},{"$f":"IF(記入!D42=\"\",\"\",記入!D42)","v":""},{"$f":"IF(記入!E42=\"\",\"\",記入!E42)","v":""},{"$f":"IF(記入!F42=\"\",\"\",記入!F42)","v":""},{"$f":"IF(記入!G42=\"\",\"\",記入!G42)","v":""},{"$f":"IF(記入!H42=\"\",\"\",記入!H42)","v":""},{"$f":"IF(記入!I42=\"\",\"\",記入!I42)","v":""},{"$f":"IF(記入!J42=\"\",\"\",記入!J42)","v":""},{"$f":"IF(記入!K42=\"\",\"\",記入!K42)","v":""},{"$f":"IF(記入!L42=\"\",\"\",記入!L42)","v":""},{"$f":"IF(記入!M42=\"\",\"\",記入!M42)","v":""},{"$f":"IF(記入!N42=\"\",\"\",記入!N42)","v":""},{"$f":"IF(記入!O42=\"\",\"\",記入!O42)","v":""},{"$f":"IF(記入!P42=\"\",\"\",記入!P42)&IF(記入!D63=\"\",\"\",\"(連絡欄有)\")","v":""}]
{"$rows_left_out":10}